بازگردانی زباله
type: Concept
preferred label: refuse recovery @en
related: كاغذ و مقوا

كاغذ و مقوا
type: Concept
broader: زباله زیست‌تخریب‌پذیر
preferred label: paper and carton @en
related: بازگردانی زباله
scope note: کاغذ ومقوا جز منابع تجدید‌پذیر و زیست‌تخریب‌پذیر است. اگر به جای استفاده از چوب برای تولید کاغذ، از کاغذهای باطله استفاده شود، دراین صورت 90درصد در مصرف آب و 50درصد در مصرف انرژی صرفه‌جویی می‌شود و هم چنین 75درصد از آلودگی هوا، جلوگیری به عمل می‌آید. در فرایند بازگردانی، کاغذهای باطله را در آب گرم به صورت خمیر در می‌آورند و پس از سفید کردن خمیر کاغذ، از آن برای تهیه‌ی کاغذ استفاده می‌کنند.

زباله زیست‌تخریب‌پذیر
type: Concept
narrower: كاغذ و مقوا
preferred label: biodegradable waste @en