سختی دایم آب
type: Concept
broader: سختی آب
preferred label: permanent hardener @en
scope note: اگر سختی آب مربوط به مقدار قابل توجهی از یون‌های +Ca2 یا +Mg2 باشد، آن را سختی دایم آب می‌گویند. سختی دایم آب با گرم كردن از بین نمی‌رود. در این مورد، یون‌های كلسیم را با اضافه كردن سدیم كربنات جدا می‌كنند.

سختی آب
type: Concept
narrower: سختی دایم آب
preferred label: water hardness @en