گوشته زمین
type: Concept
broader: كره زمین
preferred label: earth mantle @en
scope note: سیلیکات، Mg و Fe اجزای سازنده گوشته‌ی زمین هستند.

كره زمین
type: Concept
narrower: گوشته زمین
preferred label: earth @en