نیتروژن
type: Concept
preferred label: nitrogen @en
related: آمونیاك

آمونیاك
type: Concept
broader: اجزای ناچیز هوا کره
preferred label: ammonia @en
related: نیتروژن
scope note: گاز‌های آمونیاك(NH3)، نئون(Ne)، هلیم(He)، متان(CH4) و كریپتون(Kr) بر روی هم درحدود 0/004 درصد از حجم هوا‌كره را تشكیل می‌دهد.

اجزای ناچیز هوا کره
type: Concept
narrower: آمونیاك
preferred label: atmosphere teeny components @en