چگالی
type: Concept
broader: كمیت فیزیكی
preferred label: density @en
related: افزایش حجم هنگام انجماد
scope note: چگالی به دما بستگی دارد، زیرا با كم و زیاد شدن دما، حجم تغییر می‌كند.

كمیت فیزیكی
type: Concept
narrower: چگالی
preferred label: physical quantity @en

افزایش حجم هنگام انجماد
type: Concept
preferred label: volume increase during freezing @en
related: چگالی