محلول سیر‌ شده
type: Concept
broader: محلول
preferred label: saturated solution @en
scope note: محلول سیر شده، محلولی است كه نمی‌تواند حل‌شونده بیشتری را در خود حل كند.

محلول
type: Concept
narrower: محلول سیر‌ شده
preferred label: solution @en