محلول فرا‌ سیر شده
type: Concept
broader: محلول
preferred label: supersaturated solution @en
scope note: اگر مقدار حل شونده بیشتر از حد سیر شدن باشد، محلول را فرا‌ سیر شده می‌گویند.

محلول
type: Concept
narrower: محلول فرا‌ سیر شده
preferred label: solution @en