تامین انرژی
type: Concept
preferred label: energy supply @en
related: سوزاندن نفت

سوزاندن نفت
type: Concept
broader: مصارف نفت خام
preferred label: oil burning @en
related: تامین انرژی
scope note: بخش بزرگی از نیازهای ما به انرژی، با سوزاندن نفت تامین می‌شود. فراوانی ظاهری، سهولت انبارداری و حمل و نقل، کاربرد آسان و بهای ارزان نفت موجب شده است تا نفت بیش‌تر برای تامین انرژی سوزانده شود. این امر موجب آلودگی هوا می‌شود. به ویژه ورود حجم زیادی گاز کربن دی‌اکسید ناشی از سوزاندن نفت، سبب شده است که دمای زمین به تدریج افزایش یابد.

مصارف نفت خام
type: Concept
narrower: سوزاندن نفت
preferred label: petroleum uses @en