سرانه آب
type: Concept
broader: مصرف آب
preferred label: water capitation @en
scope note: سرانه آب یعنی سهم سالانه‌ی هر نفر از كل آب موجود در كشور. به دلیل رشد جمعیت و دیگر مسایل، سرانه آب در ایران طی سال‌های گذشته به شدت كم شده و در سالهای آینده نیز به شدت كم خواهد شد.

مصرف آب
type: Concept
narrower: سرانه آب
preferred label: water consumption @en