فشار هوا
type: Concept
preferred label: air pressure @en
related: میلی‌متر جیوه

میلی‌متر جیوه
type: Concept
broader: یكای فشار
preferred label: Centimeter of mercury @en
related: فشار هوا
scope note: وقتی فشار هوا بر حسب ارتفاع ستون جیوه بیان شود، واحد آن میلی‌متر جیوه (mmHg) است. میلی‌متر جیوه یكای غیر SI فشار است.

یكای فشار
type: Concept
narrower: میلی‌متر جیوه
preferred label: pressure unit @en