باتلاق‌ها
scope note: باتلاق‌ها گازهای زیان‌آوری در هوا پخش می‌كنند.
broader: آلودگی‌های طبیعی
preferred label: swamps @en
type: Concept

آلودگی‌های طبیعی
preferred label: natural pollutions @en
type: Concept
narrower: باتلاق‌ها