برش نفتی
preferred label: oil cut @en
type: Concept
narrower: برش جامد

برش جامد
scope note: برش‌های جامد و روغنی شكل نفت، كه حتی در دما‌های بالا نیز تبخیر نمی‌شوند، شامل مولكول‌هایی با اتم‌های كربن بیش‌تر از 20 می‌باشند. نیرو‌های جاذبه بین مولكولی در برش جامد از سایر برش‌ها بیش‌تر است.
broader: برش نفتی
preferred label: solid cut @en
type: Concept