كره زمین
preferred label: earth @en
type: Concept
narrower: پوسته زمین

پوسته زمین
scope note: فراوان‌ترین عنصر در پوسته‌ی زمین اکسیژن و پس از آن سیلیسیم است. سیلیکات‌ها ترکیب‌هایی هستند که بیش‌تر سنگ‌های سازنده زمین را تشکیل می‌دهند.
related: سنگ كره
broader: كره زمین
preferred label: earth crust @en
type: Concept

سنگ كره
preferred label: lithosphere @en
type: Concept
related: پوسته زمین