لایه‌های هوا کره
preferred label: atmosphere layers @en
type: Concept
narrower: تروپوسفر

اوزون تروپسفری
preferred label: tropospheric ozone @en
type: Concept
related: تروپوسفر

تروپوسفر
scope note: تروپوسفر نزدیكترین لایه به سطح زمین است و تا ارتفاع 10-12 كیلومتری از سطح زمین قرار دارد و دارای بیشترین مقدار هر ذره در لیتر می‌باشد، پس سنگینترین لایه است. ما در این بخش از هواكره زندگی می‌كنیم. به دلیل مخلوط شدن پیوسته‌ی گاز‌ها، تركیب اجزای تروپوسفر در همه جای آن یكسان است. این تركیب تقریبا همان تركیب اجزای هوا‌كره است. تروپوسفر دارای تلاطم‌ها و ناپایداری‌های جوی می‌شود و بیش‌تر هواپیماهای مسافربری در همین لایه پرواز می‌كنند. دمای هوا در این لایه نسبت به سطح زمین كمتر است. افزون بر گازهای معرفی شده نمونه‌های واقعی هوا ممكن است تا بیش از 5% رطوبت داشته باشند.
related: اوزون تروپسفری
broader: لایه‌های هوا کره
preferred label: troposphere @en
type: Concept