لایه‌های هوا کره
preferred label: atmosphere layers @en
type: Concept
narrower: مزوسفر

مزوسفر
scope note: مزوسفر از ارتفاع 50 تا 85 كیلومتری از سطح زمین قرار دارد. دمای هوا در این لایه نسبت به سطح زمین كمتر است.
broader: لایه‌های هوا کره
preferred label: mesosphere @en
type: Concept