فشار سیال
scope note: در سیال‌ها نیز مانند جامد‌ها، فشار ناشی از نیروی وزن آنها‌ست كه بر واحد سطح وارد می‌شود. پس هر چه ارتفاع سیال بیشتر باشد، به دلیل وزن بیشتر، فشار آن نیز بیشتر می‌شود. به همین دلیل است كه غواصان در عمق بیشتر فشار بیشتری را تحمل می‌كنند. فشار سیال‌ها بر خلاف جامد‌ها جهت خاصی ندارد و در همه جهت‌ها به یكسان وارد می‌شود.
related: خلاء
broader: فشار
preferred label: fluid pressure @en
type: Concept

خلاء
preferred label: vaccum @en
type: Concept
related: فشار سیال

فشار
preferred label: pressure @en
type: Concept
narrower: فشار سیال