گازهای حقیقی
scope note: به گازهایی گفته می‌شود كه رفتار آنها با توجه به نظریه جنبش مولکولی گازها قابل پیش بینی نیست.
related: گازهای ایده‌آل
broader: گازها
preferred label: real gases @en
type: Concept

گازهای ایده‌آل
preferred label: ideal gases @en
type: Concept
related: گازهای حقیقی

گازها
preferred label: gases @en
type: Concept
narrower: گازهای حقیقی