مانومتر
scope note: فشار گاز درون یك ظرف را می‌توان توسط فشار‌سنجی به نام مانو‌متر اندازه گرفت. مانو‌متر به صورت یك لوله U شكل است كه در حالت عادی، ارتفاع ستون جیوه درون آن، در دو سوی لوله یكسان است. هنگامی كه مانو‌متر را به ظرف متصل و شیر گاز را باز می‌كنیم، گاز درون ظرف بر سطح جیوه فشار می‌آورد و باعث می‌شود سطح جیوه در یك طرف لوله پایین‌تر و در طرف دیگر بالاتر برود. در این حالت اختلاف سطح جیوه در دو سوی لوله U شكل، برابر با فشار گاز درون ظرف است.
related: فشار هوا
broader: فشار سنج
preferred label: manometer @en
type: Concept

فشار هوا
preferred label: air pressure @en
type: Concept
related: مانومتر

فشار سنج
preferred label: monometer @en
type: Concept
narrower: مانومتر