محلول فرا‌ سیر شده
scope note: اگر مقدار حل شونده بیشتر از حد سیر شدن باشد، محلول را فرا‌ سیر شده می‌گویند.
broader: محلول
preferred label: supersaturated solution @en
type: Concept

محلول
preferred label: solution @en
type: Concept
narrower: محلول فرا‌ سیر شده