مصرف نهان آب
scope note: یعنی مصرف آبی كه در طول مسیر تهیه یك ماده به مصرف رسیده است. مثلا برای تولید یك كمپوت گیلاس در حدود 130 لیتر آب مصرف می‌شود و شامل آب مصرف شده برای آبیاری درختان، تامین انرژی، بخش صنایع و معادن، امور بازرگانی، خدمات و ... می‌باشد.
broader: مصرف آب
preferred label: water latent consumption @en
type: Concept

مصرف آب
preferred label: water consumption @en
type: Concept
narrower: مصرف نهان آب