مولكول قطبی
scope note: اگر یك میله پلاستیكی باردار شده را(یعنی میله‌ای كه آن را به موی سر مالش داده‌ایم) به یك باریكه آب نزدیك كنیم، آب از مسیر خود منحرف و به سوی میله كشیده می‌شود. علت آن است كه مولکول آب دارای دو قطب مثبت و منفی است و از سر قطب منفی خود به سوی میله‌ی پلاستیكی، كه در اثر مالش دارای بار مثبت شده است جذب می‌شود. در مولکول آب، بار منفی بیش‌تری در سمت اتم O و بار مثبت بیشتری در سمت اتم‌های H جمع شده است، از این رو مولکول‌ آب دارای یك سر مثبت و یك سر منفی است. در هر مولکول، تعداد الكترون و پروتون برابر است، پس هر مولکول، چه قطبی و چه غیر قطبی، در مجموع از نظر بار الكتریكی خنثی است.
related: خاصیت الكتریكی آب
broader: مولکول
preferred label: polar molecule @en
type: Concept

خاصیت الكتریكی آب
preferred label: electrical property of water @en
type: Concept
related: مولكول قطبی

مولکول
preferred label: molecule @en
type: Concept
narrower: مولكول قطبی