نماد شیمیایی
scope note: نماد شیمیایی، یك یا دو حرف لاتین است كه مشخص كننده‌ی هر عنصر می‌باشد. مثلا Fe نماد شیمیایی عنصر آهن و C نماد شیمیایی عنصر كربن است. نماد شیمیایی عنصرها ممكن است یك حرفی یا دو حرفی باشد، كه اگر دو حرفی باشد، حرف اول باید بزرگ و حرف دوم كوچك نوشته می‌شود.
related: فرمول شیمیایی
related: عناصر شیمیایی
preferred label: chemical symbols @en
type: Concept

فرمول شیمیایی
preferred label: chemical formula @en
type: Concept
related: نماد شیمیایی

عناصر شیمیایی
preferred label: chemical elements @en
type: Concept
related: نماد شیمیایی