فراورده
scope note: مواد تولید شده در واكنش را فراورده ‌گویند. فراورده‌ها را در سمت راست معادله شیمیایی می‌نویسیم.
broader: واكنش شیمیایی
preferred label: product @en
type: Concept

واكنش شیمیایی
preferred label: chemical reaction @en
type: Concept
narrower: فراورده