آب و هوا
scope note: آب و هوا عبارت از آثار و شرایط و عوارض طبیعی در هوا کره و در یک دوره زمانی ثابت است.
related: جریان‌های هوایی
related: هوا کره
preferred label: weather @en
type: Concept

جریان‌های هوایی
preferred label: airstreams @en
type: Concept
related: آب و هوا

هوا کره
preferred label: atmosphere @en
type: Concept