زنگ آهن
preferred label: iron rust @en
type: Concept
related: زنگ زدن آهن

اكسایش
preferred label: oxidation @en
type: Concept
narrower: زنگ زدن آهن

زنگ زدن آهن
scope note: برخی از واكنش‌های اكسایش نسبت به احتراق انرژی كمتری آزاد می‌كنند و با ایجاد شعله همراه نیستند، مثلا تشكیل سدیم اكسید یا زنگ زدن آهن.
related: زنگ آهن
broader: اكسایش
preferred label: iron rusting @en
type: Concept