انسان
scope note: بر اثر رعایت نكردن كامل مقررات حفاظت محیط‌ زیست توسط انسان‌ها، ورود پساب اسیدی و فضولات برخی كارخانه‌ها ، ممكن است به كاهش شدید و خطرناك pH آب منجر شود.
related: آلاینده‌های اسیدی
preferred label: man @en
type: Concept

آلاینده‌های اسیدی
preferred label: acidic pollutants @en
type: Concept
related: انسان