آلكین‌ها
preferred label: alkynes @en
type: Concept
narrower: استیلن

استیلن
scope note: استیلن (اتین) ساده‌ترین عضو از خانواده آلکین‌ها است.
broader: آلكین‌ها
preferred label: acetylene @en
type: Concept