اتیلن
preferred label: ethylene @en
type: Concept

پلاستیك‌ها
preferred label: plastics @en
type: Concept
narrower: پلی‌اتیلن

پلی‌اتیلن
scope note: در پلی‌اتیلن (پلی‌تن)، واحدهای تکرار شونده، مولکول‌های اتیلن می‌باشند. پلی‌تن در ساخت کیسه‌های پلاستیکی و ورقه‌های بسته‌بندی مصرف می‌شود. پلاستیك پلی اتیلن نسبتا نرم و تاشو برای ساختن ظرف‌های فشردنی، همانند بطری‌های سس گوجه فرنگی، به كار می‌رود و پلاستیك پلی اتیلن سخت و شكننده برای تولید لوله‌های آب و بشكه‌های پلاستیكی استفاده می‌شود.
related: اتیلن
broader: پلاستیك‌ها
preferred label: polyethylene @en
type: Concept