پلاستیك‌ها
scope note: پلاستیک‌ها موادی هستند كه از مولكول‌های بزرگی تشكیل شده‌اند. به مولکول‌های غول‌آسای سازنده‌ی این مواد، بسپار یا پلیمر می‌گویند.
narrower: پلی‌اتیلن
broader: بسپارها
preferred label: plastics @en
type: Concept

بسپارها
preferred label: polymers @en
type: Concept
narrower: پلاستیك‌ها

پلی‌اتیلن
preferred label: polyethylene @en
type: Concept
broader: پلاستیك‌ها