تصفیه آب
preferred label: water treatment @en
type: Concept
narrower: تصفیه‌ طبیعی آب

تصفیه‌ طبیعی آب
scope note: آب در طبیعت طی 3 مرحله تصفیه می‌شود: اول، هنگام تبخیر آب و تبدیل آن به برف و باران، كلیه‌ی مواد اولیه‌ی حل شده در آب تقریبا به طور كامل از آن جدا می‌شوند. دوم، برخی از مواد محلول و شناور در آب، به كمك باكتری‌ها به مواد ساده‌تر تجزیه می‌شوند. سوم، همه‌ی مواد معلق موجود درآب، به هنگام عبور از میان سنگریزه‌ها و ماسه‌های موجود در درون زمین، از آن جدا می‌شوند. تصفیه‌ی طبیعی آب برای دنیای امروزی بشر كفایت نمی‌كند، زیرا اولا فرایند تصفیه‌ی طبیعی آب بسیار كند انجام می‌شود و پاسخگوی جمعیت امروزی انسان نیست و ثانیا دستكاری‌های انسان در طبیعت و آلوده كردن آن، نظم و جریان عادی فرایندهای طبیعی، از جمله تصفیه‌ی طبیعی آب را به هم زده است. در اثر فرایندهای صنعتی، گازهای اسیدی هوا زیادتر و آب باران اسیدی‌تر می‌شود و در این صورت، انحلال یون‌هایی مانند: +Ca2+، Mg2+، Fe2 در آب بیش‌تر می‌شود. به این صورت، آب به جای تصفیه‌ی طبیعی، دچار آلودگی طبیعی می‌شود.
related: چرخه آب
broader: تصفیه آب
preferred label: natural treatment of water @en
type: Concept

چرخه آب
preferred label: water cycle @en
type: Concept
related: تصفیه‌ طبیعی آب