توزیع منابع طبیعی
scope note: منابع طبیعی در سراسر جهان به طور یکنواخت توزیع نشده‌اند و هیچ رابطه‌ای هم میان این منابع و وسعت یک سرزمین یا جمعیت آن وجود ندارد.
related: منابع طبیعی
related: مصرف دوباره
preferred label: natural resource distribution @en
type: Concept

منابع طبیعی
preferred label: natural resources @en
type: Concept
related: توزیع منابع طبیعی

مصرف دوباره
preferred label: reconsume @en
type: Concept
related: توزیع منابع طبیعی