حفاظت از منابع شیمیایی
preferred label: chemical resources protection @en
type: Concept
narrower: باز به كار بردن

باز به كار بردن
scope note: استفاده‌ی دوباره یا چند‌باره از مواد یا وسایل.
broader: حفاظت از منابع شیمیایی
preferred label: reutilization @en
type: Concept