حفاظت از منابع شیمیایی
preferred label: chemical resources protection @en
type: Concept
narrower: بازنگری كردن

بازنگری كردن
scope note: اصلاح پیوسته‌ی عادت‌های فردی و اجتماعی در استفاده کردن از مواد یا وسایل.
broader: حفاظت از منابع شیمیایی
preferred label: review @en
type: Concept