حفاظت از منابع شیمیایی
preferred label: chemical resources protection @en
type: Concept
narrower: كاهش مصرف

كاهش مصرف
scope note: کم کردن میزان مصرف و جلوگیری از ایجاد زباله.
broader: حفاظت از منابع شیمیایی
preferred label: consumption reduction @en
type: Concept