فشار سیال
preferred label: fluid pressure @en
type: Concept
related: خلاء

خلاء
scope note: در خارج از هوا‌كره‌ی زمین، هوایی وجود ندارد كه از بیرون بر بدن فضا‌نوردان فشار وارد كند، پس لباس‌های فضا‌نوردان باید این فشار بیرونی را به طور ساختگی ایجاد كند. بدون این لباس‌ها، فشار داخل بدن فضا‌نوردان باعث متلاشی شدن بدن آن‌ها در فضا می‌شود.
related: فشار سیال
related: هوا کره
preferred label: vaccum @en
type: Concept

هوا کره
preferred label: atmosphere @en
type: Concept