مواد پلاستیكی
preferred label: plastic materials @en
type: Concept
narrower: پلاستیك پلی‌اتیلن

پلاستیك پلی‌اتیلن
scope note: پلاستیك پلی اتیلن نسبتا نرم و تاشو برای ساختن ظرف‌های فشردنی، همانند بطری‌های سس گوجه فرنگی، به كار می‌رود و پلاستیك پلی اتیلن سخت و شكننده برای تولید لوله‌های آب و بشكه‌های پلاستیكی استفاده می‌شود.
broader: مواد پلاستیكی
preferred label: polyethylene plastic @en
type: Concept