سختی آب
preferred label: water hardness @en
type: Concept
narrower: سختی موقت آب

ستون‌های آهكی
preferred label: calcic columns @en
type: Concept
related: سختی موقت آب

سختی موقت آب
scope note: اگر سختی آب مربوط به كلسیم هیدروژن كربنات محلول در آب باشد، آن را سختی موقت آب می‌گویند. سختی موقت آب بر اثر حل شدن سنگ‌های آهكی در كربنیك اسید پدید می‌آید. آب باران CO2 هوا را در خود حل و آن را به كربنیك اسید تبدیل می‌كند. سپس هنگام عبور از روی سنگهای آهكی، آنها را در خود حل می‌كند. می‌توان با گرم كردن آبی كه سختی موقت دارد یون‌های كلسیم محلول در آن را به صورت رسوب كلسیم كربنات در آورد و در نتیجه، آب سخت را به آب نرم تبدیل كرد. در این آب صابون به خوبی كف می‌كند. پیدایش لایه‌های آهكی درون كتری، سماور و لوله‌های آب گرم نشان از وجود مقادیر اندكی كلسیم هیدروژن كربنات محلول(عامل سختی موقت) در آب‌های معمولی و آشامیدنی دارد.
related: ستون‌های آهكی
broader: سختی آب
preferred label: temporary hardner @en
type: Concept