آب كره
scope note: علاوه بر پوسته‌ی زمین بخش عمده‌ی منابع شیمیایی مورد نیاز انسان از آب اقیانوس‌ها، که مقادیر قابل ملاحظه‌ای کانی‌های حل شده دارند تامین می‌شود. هم‌چنین کلوخه‌های جامد در کف اقیانوس‌ها تا 24 درصد منگنز، 14 درصد آهن و مقادیری مس، نیکل و کبالت در بر‌دارند.
broader: لایه‌های سه‌گانه كره زمین
preferred label: hydrosphere @en
type: Concept

لایه‌های سه‌گانه كره زمین
preferred label: earth three layers @en
type: Concept
narrower: آب كره