الكترون
scope note: كوچكترین ذره تقسیم‌ناپذیر بار منفی كه بخشی از هر اتم را تشكیل می‌دهد. الكترون‌ها در بیرون هسته اتم قرار دارند و به دور هسته می‌چرخد. جرم الكترون تقریبا 1840 بار سبكتر از جرم پروتون است.
broader: اتم
preferred label: electron @en
type: Concept

اتم
preferred label: atom @en
type: Concept
narrower: الكترون