اتم
preferred label: atom @en
type: Concept
narrower: نوترون

نوترون
scope note: ذره كوچك و بی بار(خنثی)، واقع در هسته اتم. جرم نوترون تقریبا برابر جرم پروتون است.
broader: اتم
preferred label: neutron @en
type: Concept