عناصر شیمیایی
preferred label: chemical elements @en
type: Concept
narrower: شبه فلز

شبه فلز
scope note: عنصر‌هایی هستند كه خواص آن‌ها بین فلز‌ها و نافلز‌ها است مانند:سیلیسیم (Si)، آرسنیك (As) و آنتیموان (Sb).
broader: عناصر شیمیایی
preferred label: semimetal @en
type: Concept