عناصر شیمیایی
preferred label: chemical elements @en
type: Concept
narrower: نافلزها

نافلزها
scope note: چند مورد از خواص نافلزات به شرح زیر است: 1) بیش‌تر آن‌ها نقطه‌ی ذوب و جوش پایینی دارند. 2) سطح کدر و گرفته‌ای دارند. 3) در حالت جامد شکننده‌اند. 4) عایق جریان برق و گرما هستند. هیدروژن (H2) کمترین چگالی و ید (I2) بیش‌ترین چگالی را در بین نافلزها دارند. واكنش‌پذیر‌ترین نافلز فلوئور (F2) است و كم‌ترین واكنش‌پذیری را در بین نافلز‌ها هلیم(He) دارد.
related: واكنش‌پذیری شیمیایی
broader: عناصر شیمیایی
preferred label: nonmetals @en
type: Concept

واكنش‌پذیری شیمیایی
preferred label: chemical reactivity @en
type: Concept
related: نافلزها