آب شیرین
preferred label: fresh water @en
type: Concept
narrower: آبهای زیرزمینی

آبهای زیرزمینی
scope note: 0/47 درصد از آب كره زمین مربوط به آبهای زیر زمینی است.
broader: آب شیرین
preferred label: ground water @en
type: Concept