آب شیرین
preferred label: fresh water @en
type: Concept
narrower: رطوبت خاك

رطوبت خاك
scope note: كمتر از 0/01 درصد از آب كره زمین مربوط به رطوبت خاك است.
broader: آب شیرین
preferred label: soil moisture @en
type: Concept