منابع شیمیایی
preferred label: chemical resources @en
type: Concept
narrower: كانه

كانه
scope note: کانه (کانسنگ یا سنگ معدن‌) موادی هستند كه به طور طبیعی یافت می‌شوند. كانه از كانی یا كانی‌هایی تشكیل شده است كه استخراج مواد موجود در آن از نظر اقتصادی به صرفه باشد. ( كانه را معمولا در مورد سنگ‌های معدنی فلزدار به كار می‌برند.)
broader: منابع شیمیایی
preferred label: ore @en
type: Concept