منابع شیمیایی
preferred label: chemical resources @en
type: Concept
narrower: مواد خام

مواد خام
scope note: به موادی می‌گویند كه به طور مستقیم خیلی قابل استفاده نیستند اما می‌توان با اجرای فرایند‌هایی آن‌ها را به مواد شیمیایی سودمندی تبدیل كرد.
broader: منابع شیمیایی
preferred label: raw materials @en
type: Concept