واكنش‌پذیری آلومینیم
scope note: آلومینیم واكنش‌پذیرتر از آهن است ولی وسایل آلومینیمی بیش‌تر عمر می‌كنند زیرا لایه‌ی بسیار نازك آلومینیم اكسید ( Al2O3) كه در سطح Al تشكیل می‌شود، مانند پوشش محافظ، از ادامه‌ی اكسایش آلومینیم جلوگیری می‌كند.
broader: واكنش‌پذیری شیمیایی
preferred label: aluminium reactivity @en
type: Concept

واكنش‌پذیری شیمیایی
preferred label: chemical reactivity @en
type: Concept
narrower: واكنش‌پذیری آلومینیم