واكنش‌پذیری آهن
scope note: زنگ‌آهنی كه در سطح آهن تشكیل می‌شود به تدریج پوسته پوسته می‌شود و می‌ریزد و اكسایش آهن هم‌چنان ادامه می‌یابد. راه‌های جلوگیری از زنگ آهن: 1) سطح آهن را با رنگ یا فلزهایی مثل روی، كروم یا قلع می‌پوشانند. 2) سطح آهن را با لعاب سرامیك می‌پوشانند ( مثل اجاق گاز، یخچال و وان حمام). 3) آهن را با برخی از فلزها آلیاژ می‌كنند، مانند فولاد زنگ‌نزن كه آلیاژی از Fe, Cr,Ni می‌باشد و در برابر خوردگی، مقاوم است.
broader: واكنش‌پذیری شیمیایی
preferred label: iron reactivity @en
type: Concept

واكنش‌پذیری شیمیایی
preferred label: chemical reactivity @en
type: Concept
narrower: واكنش‌پذیری آهن