واكنش‌پذیری منیزیم
scope note: شدت واكنش‌پذیری منیزیم از آهن بیش‌تر است زیرا سرعت واكنش اكسایش منیزیم خیلی بیش‌تر از آهن است، به طوری كه اگر نوار منیزیم را در شعله‌ی چراغ گرم كنیم با نور خیره‌كننده‌ای، به سرعت می‌سوزد و منیزیم اكسید تولید می‌شود. 2Mg(s) + O2(g) -> 2 MgO(s)
broader: واكنش‌پذیری شیمیایی
preferred label: magnesium reactivity @en
type: Concept

واكنش‌پذیری شیمیایی
preferred label: chemical reactivity @en
type: Concept
narrower: واكنش‌پذیری منیزیم