سیال‌سازی
type: Concept
broader: فناوری شیمیایی
preferred label: fluidization @en
related: بستر سیال
scope note: روشی که در آن با معلق کردن ذرات جامد در مایع یا گاز در حال حرکت ذرات جامد رفتاری مانند سیال پیدا می‌کنند.

فناوری شیمیایی
type: Concept
narrower: سیال‌سازی
preferred label: chemical technology @en

بستر سیال
type: Concept
preferred label: fluidised bed @en
related: سیال‌سازی